BDBM50317743 4-(4'-methoxy-3'-(methylsulfonyl)biphenyl-3-yl)-3-methyl-8-(trifluoromethyl)quinoline::CHEMBL1099133
SMILES COc1ccc(cc1S(C)(=O)=O)-c1cccc(c1)-c1c(C)cnc2c(cccc12)C(F)(F)F
InChI Key InChIKey=MKHOYUJKXDXRQG-UHFFFAOYSA-N
Data  2 IC50
  Tab Delimited (TSV)   2D SDfile   Computed 3D by Vconf -m prep SDfile
Find this compound or compounds like it in BindingDB:
Activity Spreadsheet -- Enzyme Inhibition Constant Data from BindingDB
Found 2 hits for monomerid = 50317743
TargetOxysterols receptor LXR-alpha(Homo sapiens (Human))
Wyeth Pharmaceuticals
Curated by ChEMBL
LigandPNGBDBM50317743(4-(4'-methoxy-3'-(methylsulfonyl)biphenyl-3-yl)-3-...)
Affinity DataIC50: >1.00E+3nM. Assay description: Displacement of [3H]T0901317 from LXRalpha ligand binding domain
In DepthDetails ArticlePubMed
TargetOxysterols receptor LXR-beta(Homo sapiens (Human))
Wyeth Pharmaceuticals
Curated by ChEMBL
LigandPNGBDBM50317743(4-(4'-methoxy-3'-(methylsulfonyl)biphenyl-3-yl)-3-...)
Affinity DataIC50:  629nM. Assay description: Displacement of [3H]T0901317 from LXRbeta ligand binding domain
In DepthDetails ArticlePubMed