BDBM50318720 CHEMBL1083488::N1-(7,8,9,10-tetrahydro-6H-cyclohepta[b][1,8]naphthyridin-5-yl)-N6-(7,8,9,10-tetrahydro-6H-cyclohepta[b]quinolin-11-yl)hexane-1,6-diamine
SMILES C(CCCNc1c2CCCCCc2nc2ncccc12)CCNc1c2CCCCCc2nc2ccccc12
InChI Key InChIKey=CUNSKXFDFJIUPQ-UHFFFAOYSA-N
Data  1 IC50
  Tab Delimited (TSV)   2D SDfile   Computed 3D by Vconf -m prep SDfile
Find this compound or compounds like it in BindingDB:
Activity Spreadsheet -- Enzyme Inhibition Constant Data from BindingDB
Found 1 hit for monomerid = 50318720
TargetAcetylcholinesterase(Homo sapiens (Human))
Sichuan University
Curated by ChEMBL
LigandPNGBDBM50318720(CHEMBL1083488 | N1-(7,8,9,10-tetrahydro-6H-cyclohe...)
Affinity DataIC50:  2.5nM. Assay description: Inhibition of AChE
In DepthDetails ArticlePubMed