BDBM50318727 3-((methyl(7-(3-oxo-2-(3,4,5-trihydroxybenzylidene)-2,3-dihydrobenzofuran-6-yloxy)heptyl)amino)methyl)phenyl methylcarbamate::CHEMBL1085932
SMILES CNC(=O)Oc1cccc(CN(C)CCCCCCCOc2ccc3C(=O)C(Oc3c2)=Cc2cc(O)c(O)c(O)c2)c1
InChI Key InChIKey=VEFMPDZVTZNAQM-UHFFFAOYSA-N
Data  1 IC50
  Tab Delimited (TSV)   2D SDfile   Computed 3D by Vconf -m prep SDfile
Find this compound or compounds like it in BindingDB:
Activity Spreadsheet -- Enzyme Inhibition Constant Data from BindingDB
Found 1 hit for monomerid = 50318727
TargetAcetylcholinesterase(Homo sapiens (Human))
Sichuan University
Curated by ChEMBL
LigandPNGBDBM50318727(3-((methyl(7-(3-oxo-2-(3,4,5-trihydroxybenzylidene...)
Affinity DataIC50:  0.520nM. Assay description: Inhibition of AChE
In DepthDetails ArticlePubMed