BDBM50319628 CHEMBL1083394::Triphloroethol A
SMILES Oc1cc(O)c(Oc2cc(O)cc(O)c2Oc2cc(O)cc(O)c2)c(O)c1
InChI Key InChIKey=OXFVHFABBAINFL-UHFFFAOYSA-N
Data  1 KI  1 IC50
  Tab Delimited (TSV)   2D SDfile   Computed 3D by Vconf -m prep SDfile
Find this compound or compounds like it in BindingDB:
Activity Spreadsheet -- Enzyme Inhibition Constant Data from BindingDB
Found 2 hits for monomerid = 50319628
TargetBeta-secretase 1(Homo sapiens (Human))
Pukyong National University
Curated by ChEMBL
LigandPNGBDBM50319628(CHEMBL1083394 | Triphloroethol A)
Affinity DataKi:  1.21E+4nM. Assay description: Noncompetitive inhibition of human recombinant BACE1 after 60 mins by Dixon plot analysis
In DepthDetails ArticlePubMed
TargetBeta-secretase 1(Homo sapiens (Human))
Pukyong National University
Curated by ChEMBL
LigandPNGBDBM50319628(CHEMBL1083394 | Triphloroethol A)
Affinity DataIC50:  1.17E+4nM. Assay description: Inhibition of human recombinant BACE1 after 60 mins by FRET assay
In DepthDetails ArticlePubMed