BDBM50319811 (4-(benzo[b]thiophen-3-yl)-2-chlorophenyl)((1S,5R)-1,3,3-trimethyl-6-azabicyclo[3.2.1]octan-6-yl)methanone::CHEMBL1084070
SMILES C[C@@]12C[C@@H](CC(C)(C)C1)N(C2)C(=O)c1ccc(cc1Cl)-c1csc2ccccc12
InChI Key InChIKey=IDPZADGUBFIRPX-CRICUBBOSA-N
Data  2 KI
  Tab Delimited (TSV)   2D SDfile   Computed 3D by Vconf -m prep SDfile
Find this compound or compounds like it in BindingDB:
Activity Spreadsheet -- Enzyme Inhibition Constant Data from BindingDB
Found 2 hits for monomerid = 50319811
TargetVasopressin V1a receptor(Homo sapiens (Human))
Pfizer
Curated by ChEMBL
LigandPNGBDBM50319811((4-(benzo[b]thiophen-3-yl)-2-chlorophenyl)((1S,5R)...)
Affinity DataKi:  52nM. Assay description: Displacement [3H]Arg human recombinant Vasopressin V1a receptor
In DepthDetails ArticlePubMed
TargetVasopressin V2 receptor(Homo sapiens (Human))
Pfizer
Curated by ChEMBL
LigandPNGBDBM50319811((4-(benzo[b]thiophen-3-yl)-2-chlorophenyl)((1S,5R)...)
Affinity DataKi:  171nM. Assay description: Displacement [3H]Arg human recombinant Vasopressin V2 receptor
In DepthDetails ArticlePubMed