BDBM50320737 (R)-N-(2-Aminophenyl)-6-((1R,3aS,7aR,E)-4-(2-((3R,5R)-3,5-dihydroxycyclohexylidene)ethylidene)-7a-methyl-octahydro-1H-inden-1-yl)heptanamide::CHEMBL1165293
SMILES [#6]-[#6@H](-[#6]-[#6]-[#6]-[#6]-[#6](=O)-[#7]-c1ccccc1-[#7])-[#6@H]1-[#6]-[#6]-[#6@H]2\[#6](-[#6]-[#6]-[#6][C@]12[#6])=[#6]\[#6]=[#6]-1/[#6]-[#6@@H](-[#8])-[#6]-[#6@H](-[#8])-[#6]-1
InChI Key InChIKey=CZSCYVHOZGHUJC-RKERBXOMSA-N
Data  6 IC50
  Tab Delimited (TSV)   2D SDfile   Computed 3D by Vconf -m prep SDfile
Find this compound or compounds like it in BindingDB:
Activity Spreadsheet -- Enzyme Inhibition Constant Data from BindingDB
Found 6 hits for monomerid = 50320737
TargetVitamin D3 receptor(Homo sapiens (Human))
Mcgill University
Curated by ChEMBL
LigandPNGBDBM50320737((R)-N-(2-Aminophenyl)-6-((1R,3aS,7aR,E)-4-(2-((3R,...)
Affinity DataIC50:  248nM. Assay description: Binding affinity to VDR-LBD by fluorescence polarization competition assay
In DepthDetails ArticlePubMed
TargetHistone deacetylase 6(Homo sapiens (Human))
Mcgill University
Curated by ChEMBL
LigandPNGBDBM50320737((R)-N-(2-Aminophenyl)-6-((1R,3aS,7aR,E)-4-(2-((3R,...)
Affinity DataIC50:  8.10E+4nM. Assay description: Inhibition of human recombinant HDAC6 by fluorescence assay
In DepthDetails ArticlePubMed
TargetVitamin D3 receptor(Homo sapiens (Human))
Mcgill University
Curated by ChEMBL
LigandPNGBDBM50320737((R)-N-(2-Aminophenyl)-6-((1R,3aS,7aR,E)-4-(2-((3R,...)
Affinity DataIC50:  185nM. Assay description: Binding affinity to VDR ligand binding domain by fluorescence polarization competition assay
In DepthDetails ArticlePubMed
TargetHistone deacetylase 3(Homo sapiens (Human))
Mcgill University
Curated by ChEMBL
LigandPNGBDBM50320737((R)-N-(2-Aminophenyl)-6-((1R,3aS,7aR,E)-4-(2-((3R,...)
Affinity DataIC50:  1.04E+5nM. Assay description: Inhibition of HDAC3 after 10 mins by fluorometric assay
In DepthDetails ArticlePubMed
TargetHistone deacetylase 6(Homo sapiens (Human))
Mcgill University
Curated by ChEMBL
LigandPNGBDBM50320737((R)-N-(2-Aminophenyl)-6-((1R,3aS,7aR,E)-4-(2-((3R,...)
Affinity DataIC50:  8.11E+4nM. Assay description: Inhibition of HDAC6 after 10 mins by fluorometric assay
In DepthDetails ArticlePubMed
TargetHistone deacetylase 2(Homo sapiens (Human))
Mcgill University
Curated by ChEMBL
LigandPNGBDBM50320737((R)-N-(2-Aminophenyl)-6-((1R,3aS,7aR,E)-4-(2-((3R,...)
Affinity DataIC50:  1.89E+5nM. Assay description: Inhibition of HDAC2 after 10 mins by fluorometric assay
In DepthDetails ArticlePubMed