BDBM50320745 CHEMBL1165082::N-((R)-5-((1R,3aS,7aR,E)-4-(2-((3R,5R)-3,5-Dihydroxycyclohexylidene)ethylidene)-7a-methyl-octahydro-1H-inden-1-yl)hexyl)butane-1-sulfonamide
SMILES [#6]-[#6]-[#6]-[#6]S(=O)(=O)[#7]-[#6]-[#6]-[#6]-[#6]-[#6@@H](-[#6])-[#6@H]1-[#6]-[#6]-[#6@H]2\[#6](-[#6]-[#6]-[#6][C@]12[#6])=[#6]\[#6]=[#6]-1/[#6]-[#6@@H](-[#8])-[#6]-[#6@H](-[#8])-[#6]-1
InChI Key InChIKey=ZWUCKIFEMGDZQF-GIXCGDJTSA-N
Data  3 IC50
  Tab Delimited (TSV)   2D SDfile   Computed 3D by Vconf -m prep SDfile
Find this compound or compounds like it in BindingDB:
Activity Spreadsheet -- Enzyme Inhibition Constant Data from BindingDB
Found 3 hits for monomerid = 50320745
TargetHistone deacetylase 3(Homo sapiens (Human))
Mcgill University
Curated by ChEMBL
LigandPNGBDBM50320745(CHEMBL1165082 | N-((R)-5-((1R,3aS,7aR,E)-4-(2-((3R...)
Affinity DataIC50:  7.25E+5nM. Assay description: Inhibition of HDAC3 after 10 mins by fluorometric assay
In DepthDetails ArticlePubMed
TargetVitamin D3 receptor(Homo sapiens (Human))
Mcgill University
Curated by ChEMBL
LigandPNGBDBM50320745(CHEMBL1165082 | N-((R)-5-((1R,3aS,7aR,E)-4-(2-((3R...)
Affinity DataIC50:  29nM. Assay description: Binding affinity to VDR ligand binding domain by fluorescence polarization competition assay
In DepthDetails ArticlePubMed
TargetHistone deacetylase 6(Homo sapiens (Human))
Mcgill University
Curated by ChEMBL
LigandPNGBDBM50320745(CHEMBL1165082 | N-((R)-5-((1R,3aS,7aR,E)-4-(2-((3R...)
Affinity DataIC50:  1.01E+5nM. Assay description: Inhibition of HDAC6 after 10 mins by fluorometric assay
In DepthDetails ArticlePubMed