BDBM50321359 4-cyano-N-(2-(4,4-dimethylcyclohex-1-enyl)-4-(6-methoxypyridin-3-yl)phenyl)-1H-imidazole-2-carboxamide::CHEMBL1172314
SMILES COc1ccc(cn1)-c1ccc(NC(=O)c2ncc([nH]2)C#N)c(c1)C1=CCC(C)(C)CC1
InChI Key InChIKey=YWBCSPXHHZSLKR-UHFFFAOYSA-N
Data  1 IC50
  Tab Delimited (TSV)   2D SDfile   Computed 3D by Vconf -m prep SDfile
Find this compound or compounds like it in BindingDB:
Activity Spreadsheet -- Enzyme Inhibition Constant Data from BindingDB
Found 1 hit for monomerid = 50321359
TargetMacrophage colony-stimulating factor 1 receptor(Homo sapiens (Human))
Johnson & Johnson Pharmaceutical Research & Development
Curated by ChEMBL
LigandPNGBDBM50321359(4-cyano-N-(2-(4,4-dimethylcyclohex-1-enyl)-4-(6-me...)
Affinity DataIC50:  41nM. Assay description: Inhibition of human FMS by fluorescence polarization
In DepthDetails ArticlePubMed