BDBM50321361 CHEMBL1172530::N-(4'-amino-3-cyclohexenylbiphenyl-4-yl)-4-cyano-1H-imidazole-2-carboxamide
SMILES Nc1ccc(cc1)-c1ccc(NC(=O)c2ncc([nH]2)C#N)c(c1)C1=CCCCC1
InChI Key InChIKey=ZCCALERJOKOJPU-UHFFFAOYSA-N
Data  1 IC50
  Tab Delimited (TSV)   2D SDfile   Computed 3D by Vconf -m prep SDfile
Find this compound or compounds like it in BindingDB:
Activity Spreadsheet -- Enzyme Inhibition Constant Data from BindingDB
Found 1 hit for monomerid = 50321361
TargetMacrophage colony-stimulating factor 1 receptor(Homo sapiens (Human))
Johnson & Johnson Pharmaceutical Research & Development
Curated by ChEMBL
LigandPNGBDBM50321361(CHEMBL1172530 | N-(4'-amino-3-cyclohexenylbiphenyl...)
Affinity DataIC50:  23nM. Assay description: Inhibition of human FMS by fluorescence polarization
In DepthDetails ArticlePubMed