BDBM50321372 4-cyano-N-(4-(2-(cyanoimino)hexahydropyrimidin-5-yl)-2-(4,4-dimethylcyclohex-1-enyl)phenyl)-1H-imidazole-2-carboxamide::CHEMBL1170997
SMILES CC1(C)CCC(=CC1)c1cc(ccc1NC(=O)c1ncc([nH]1)C#N)C1CNC(NC1)=NC#N
InChI Key InChIKey=NHJHHPBWTWRHSF-UHFFFAOYSA-N
Data  1 IC50
  Tab Delimited (TSV)   2D SDfile   Computed 3D by Vconf -m prep SDfile
Find this compound or compounds like it in BindingDB:
Activity Spreadsheet -- Enzyme Inhibition Constant Data from BindingDB
Found 1 hit for monomerid = 50321372
TargetMacrophage colony-stimulating factor 1 receptor(Homo sapiens (Human))
Johnson & Johnson Pharmaceutical Research & Development
Curated by ChEMBL
LigandPNGBDBM50321372(4-cyano-N-(4-(2-(cyanoimino)hexahydropyrimidin-5-y...)
Affinity DataIC50:  2.5nM. Assay description: Inhibition of human FMS by fluorescence polarization
In DepthDetails ArticlePubMed