BDBM50321968 CHEMBL1173486::N-(4-Chlorophenyl)-2-morpholino-9H-purin-6-amine
SMILES Clc1ccc(Nc2nc(nc3nc[nH]c23)N2CCOCC2)cc1
InChI Key InChIKey=NOWFBLBRSHDWLB-UHFFFAOYSA-N
Data  1 IC50
  Tab Delimited (TSV)   2D SDfile   Computed 3D by Vconf -m prep SDfile
Find this compound or compounds like it in BindingDB:
Activity Spreadsheet -- Enzyme Inhibition Constant Data from BindingDB
Found 1 hit for monomerid = 50321968
TargetProto-oncogene tyrosine-protein kinase Src(Homo sapiens (Human))
Chinese Academy Of Sciences
Curated by ChEMBL
LigandPNGBDBM50321968(CHEMBL1173486 | N-(4-Chlorophenyl)-2-morpholino-9H...)
Affinity DataIC50:  340nM. Assay description: Inhibition cSRC
In DepthDetails ArticlePubMed