BDBM50321977 CHEMBL1173247::N-(3-Methoxyphenyl)-2-(4-(2-hydroxyethyl)piperazin-1-yl)-9H-purin-6-amine
SMILES COc1cccc(Nc2nc(nc3nc[nH]c23)N2CCN(CCO)CC2)c1
InChI Key InChIKey=CPZZPNFLVVKVQF-UHFFFAOYSA-N
Data  1 IC50
  Tab Delimited (TSV)   2D SDfile   Computed 3D by Vconf -m prep SDfile
Find this compound or compounds like it in BindingDB:
Activity Spreadsheet -- Enzyme Inhibition Constant Data from BindingDB
Found 1 hit for monomerid = 50321977
TargetProto-oncogene tyrosine-protein kinase Src(Homo sapiens (Human))
Chinese Academy Of Sciences
Curated by ChEMBL
LigandPNGBDBM50321977(CHEMBL1173247 | N-(3-Methoxyphenyl)-2-(4-(2-hydrox...)
Affinity DataIC50:  1.20E+3nM. Assay description: Inhibition cSRC
In DepthDetails ArticlePubMed