BDBM50322235 8-(Benzofuran-3-ylmethyl)-3-(2-fluoroethyl)-1-phenyl-1,3,8-triazaspiro[4.5]decan-4-one oxalate::CHEMBL1170085
SMILES FCCN1CN(c2ccccc2)C2(CCN(Cc3coc4ccccc34)CC2)C1=O
InChI Key InChIKey=YVYNLGNFOSLQJL-UHFFFAOYSA-N
Data  4 KI
  Tab Delimited (TSV)   2D SDfile   Computed 3D by Vconf -m prep SDfile
Find this compound or compounds like it in BindingDB:
Activity Spreadsheet -- Enzyme Inhibition Constant Data from BindingDB
Found 4 hits for monomerid = 50322235
TargetD(2) dopamine receptor(Homo sapiens (Human))
Washington University
Curated by ChEMBL
LigandPNGBDBM50322235(8-(Benzofuran-3-ylmethyl)-3-(2-fluoroethyl)-1-phen...)
Affinity DataKi:  8nM. Assay description: Displacement of [125I]ABN from human dopamine D2 long receptor expressed in HEK293 cells after 60 mins by gamma counting
In DepthDetails ArticlePubMed
TargetD(3) dopamine receptor(Homo sapiens (Human))
Washington University
Curated by ChEMBL
LigandPNGBDBM50322235(8-(Benzofuran-3-ylmethyl)-3-(2-fluoroethyl)-1-phen...)
Affinity DataKi:  9.30nM. Assay description: Displacement of [125I]ABN from human dopamine D3 receptor expressed in HEK293 cells after 60 mins by gamma counting
In DepthDetails ArticlePubMed
TargetSigma non-opioid intracellular receptor 1(Cavia porcellus (Guinea pig))
Washington University
Curated by ChEMBL
LigandPNGBDBM50322235(8-(Benzofuran-3-ylmethyl)-3-(2-fluoroethyl)-1-phen...)
Affinity DataKi:  28nM. Assay description: Displacement of [3H](+)-pentazocine from sigma 1 receptor in guinea pig brain homogenates after 1 hr by liquid scintillation counting
In DepthDetails ArticlePubMed
TargetD(4) dopamine receptor(Homo sapiens (Human))
Washington University
Curated by ChEMBL
LigandPNGBDBM50322235(8-(Benzofuran-3-ylmethyl)-3-(2-fluoroethyl)-1-phen...)
Affinity DataKi:  945nM. Assay description: Displacement of [125I]ABN from human dopamine D4 receptor expressed in HEK293 cells after 60 mins by gamma counting
In DepthDetails ArticlePubMed