BDBM50322243 1-(Benzofuran-2-ylmethyl)-4-(4-bromophenyl)piperidin-4-ol oxalate::CHEMBL1172210
SMILES OC1(CCN(Cc2cc3ccccc3o2)CC1)c1ccc(Br)cc1
InChI Key InChIKey=GRGMUZDLZOQJFY-UHFFFAOYSA-N
Data  4 KI
  Tab Delimited (TSV)   2D SDfile   Computed 3D by Vconf -m prep SDfile
Find this compound or compounds like it in BindingDB:
Activity Spreadsheet -- Enzyme Inhibition Constant Data from BindingDB
Found 4 hits for monomerid = 50322243
TargetSigma non-opioid intracellular receptor 1(Cavia porcellus (Guinea pig))
Washington University
Curated by ChEMBL
LigandPNGBDBM50322243(1-(Benzofuran-2-ylmethyl)-4-(4-bromophenyl)piperid...)
Affinity DataKi:  2.45nM. Assay description: Displacement of [3H](+)-pentazocine from sigma 1 receptor in guinea pig brain homogenates after 1 hr by liquid scintillation counting
In DepthDetails ArticlePubMed
TargetD(2) dopamine receptor(Homo sapiens (Human))
Washington University
Curated by ChEMBL
LigandPNGBDBM50322243(1-(Benzofuran-2-ylmethyl)-4-(4-bromophenyl)piperid...)
Affinity DataKi:  17.3nM. Assay description: Displacement of [125I]ABN from human dopamine D2 long receptor expressed in HEK293 cells after 60 mins by gamma counting
In DepthDetails ArticlePubMed
TargetD(3) dopamine receptor(Homo sapiens (Human))
Washington University
Curated by ChEMBL
LigandPNGBDBM50322243(1-(Benzofuran-2-ylmethyl)-4-(4-bromophenyl)piperid...)
Affinity DataKi:  31.8nM. Assay description: Displacement of [125I]ABN from human dopamine D3 receptor expressed in HEK293 cells after 60 mins by gamma counting
In DepthDetails ArticlePubMed
TargetD(4) dopamine receptor(Homo sapiens (Human))
Washington University
Curated by ChEMBL
LigandPNGBDBM50322243(1-(Benzofuran-2-ylmethyl)-4-(4-bromophenyl)piperid...)
Affinity DataKi:  254nM. Assay description: Displacement of [125I]ABN from human dopamine D4 receptor expressed in HEK293 cells after 60 mins by gamma counting
In DepthDetails ArticlePubMed