BDBM50324505 6-(aminomethyl)-5-(2,4-dichlorophenyl)-N,7-dimethyl-N-(pyridin-4-ylmethyl)imidazo[1,2-a]pyrimidine-2-carboxamide::CHEMBL1215299
SMILES CN(Cc1ccncc1)C(=O)c1cn2c(c(CN)c(C)nc2n1)-c1ccc(Cl)cc1Cl
InChI Key InChIKey=HDHQMFMRHMYKAS-UHFFFAOYSA-N
Data  3 KI
  Tab Delimited (TSV)   2D SDfile   Computed 3D by Vconf -m prep SDfile
Find this compound or compounds like it in BindingDB:
Activity Spreadsheet -- Enzyme Inhibition Constant Data from BindingDB
Found 3 hits for monomerid = 50324505
TargetDipeptidyl peptidase 9(Homo sapiens (Human))
Bristol-Myers Squibb
Curated by ChEMBL
LigandPNGBDBM50324505(6-(aminomethyl)-5-(2,4-dichlorophenyl)-N,7-dimethy...)
Affinity DataKi:  0.860nM. Assay description: Inhibition of human DPP9
In DepthDetails ArticlePubMed
TargetDipeptidyl peptidase 8(Homo sapiens (Human))
Bristol-Myers Squibb
Curated by ChEMBL
LigandPNGBDBM50324505(6-(aminomethyl)-5-(2,4-dichlorophenyl)-N,7-dimethy...)
Affinity DataKi:  1.10nM. Assay description: Inhibition of human DPP8
In DepthDetails ArticlePubMed
TargetDipeptidyl peptidase 4(Homo sapiens (Human))
Bristol-Myers Squibb
Curated by ChEMBL
LigandPNGBDBM50324505(6-(aminomethyl)-5-(2,4-dichlorophenyl)-N,7-dimethy...)
Affinity DataKi:  2.60nM. Assay description: Inhibition of human recombinant DPP4 assessed as Gly-Pro-pNA cleavage
In DepthDetails ArticlePubMed