BDBM50324516 (6-(aminomethyl)-5-(2,4-dichlorophenyl)-7-methylimidazo[1,2-a]pyrimidin-2-yl)(pyrrolidin-1-yl)methanone::CHEMBL1214942
SMILES Cc1nc2nc(cn2c(c1CN)-c1ccc(Cl)cc1Cl)C(=O)N1CCCC1
InChI Key InChIKey=BULFOJDUFCMBCV-UHFFFAOYSA-N
Data  3 KI
  Tab Delimited (TSV)   2D SDfile   Computed 3D by Vconf -m prep SDfile
Find this compound or compounds like it in BindingDB:
Activity Spreadsheet -- Enzyme Inhibition Constant Data from BindingDB
Found 3 hits for monomerid = 50324516
TargetDipeptidyl peptidase 9(Homo sapiens (Human))
Bristol-Myers Squibb
Curated by ChEMBL
LigandPNGBDBM50324516((6-(aminomethyl)-5-(2,4-dichlorophenyl)-7-methylim...)
Affinity DataKi:  1nM. Assay description: Inhibition of human DPP9
In DepthDetails ArticlePubMed
TargetDipeptidyl peptidase 8(Homo sapiens (Human))
Bristol-Myers Squibb
Curated by ChEMBL
LigandPNGBDBM50324516((6-(aminomethyl)-5-(2,4-dichlorophenyl)-7-methylim...)
Affinity DataKi:  2.20nM. Assay description: Inhibition of human DPP8
In DepthDetails ArticlePubMed
TargetDipeptidyl peptidase 4(Homo sapiens (Human))
Bristol-Myers Squibb
Curated by ChEMBL
LigandPNGBDBM50324516((6-(aminomethyl)-5-(2,4-dichlorophenyl)-7-methylim...)
Affinity DataKi:  2.90nM. Assay description: Inhibition of human recombinant DPP4 assessed as Gly-Pro-pNA cleavage
In DepthDetails ArticlePubMed