BDBM50324729 CHEMBL1222174
SMILES CC[C@H](C)[C@H](NC(=O)[C@H](Cc1ccccc1)NC(=O)[C@H](CCC(O)=O)NC(=O)[C@@H]1CCCCNC(=O)CC[C@H](NC(=O)[C@H](CC(O)=O)NC(=O)[C@H](CC(C)C)NC(=O)[C@H](Cc2ccc(O)cc2)NC(=O)[C@H](CCCCN)NC(=O)[C@H](CO)NC(=O)[C@H](Cc2ccc(O)cc2)NC(=O)[C@H](CC(O)=O)NC(=O)[C@H](CO)NC(=O)[C@@H](NC(=O)[C@H](Cc2ccccc2)NC(=O)[C@@H](NC(=O)CNC(=O)[C@H](CCC(N)=O)NC(=O)C(C)CN[C@@H](Cc2cnc[nH]2)C(O)=O)[C@@H](C)O)[C@@H](C)O)C(=O)N[C@@H](CCC(N)=O)C(=O)N[C@@H](C)C(=O)N[C@@H](C)C(=O)N1)C(=O)N[C@@H](C)C(=O)N[C@@H](Cc1c[nH]c2ccccc12)C(=O)N[C@@H](CC(C)C)C(=O)N[C@@H](CCSC)C(=O)N[C@@H](CC(N)=O)C(=O)N[C@@H]([C@@H](C)O)C(O)=O
InChI Key InChIKey=UCZYHAGOEMBFHY-MZTAAKPHSA-N
Data  2 EC50
  Tab Delimited (TSV)   2D SDfile   Computed 3D by Vconf -m prep SDfile
Find this compound or compounds like it in BindingDB:
Activity Spreadsheet -- Enzyme Inhibition Constant Data from BindingDB
Found 2 hits for monomerid = 50324729
TargetGlucagon-like peptide 1 receptor(Homo sapiens (Human))
Indiana University
Curated by ChEMBL
LigandPNGBDBM50324729(CHEMBL1222174)
Affinity DataEC50:  0.0130nM. Assay description: Agonist activity at GLP1R expressed in HEK293 cells assessed as stimulation of cAMP production by luciferase reporter gene assay
In DepthDetails ArticlePubMed
TargetGlucagon receptor(Homo sapiens (Human))
Indiana University
Curated by ChEMBL
LigandPNGBDBM50324729(CHEMBL1222174)
Affinity DataEC50:  0.0550nM. Assay description: Agonist activity at GCGR expressed in HEK293 cells assessed as stimulation of cAMP production by luciferase reporter gene assay
In DepthDetails ArticlePubMed