BDBM50324869 CHEMBL1222135::naphthalene-2-sulfonic acid isopropyl-[4-(4-methyl-piperazin-1-yl)-phenyl]-amide
SMILES CC(C)N(c1ccc(cc1)N1CCN(C)CC1)S(=O)(=O)c1ccc2ccccc2c1
InChI Key InChIKey=CUHSWRCFUZEEGS-UHFFFAOYSA-N
Data  2 IC50
  Tab Delimited (TSV)   2D SDfile   Computed 3D by Vconf -m prep SDfile
Find this compound or compounds like it in BindingDB:
Activity Spreadsheet -- Enzyme Inhibition Constant Data from BindingDB
Found 2 hits for monomerid = 50324869
Target5-hydroxytryptamine receptor 2C(Homo sapiens (Human))
Korea Research Institute Of Chemical Technology
Curated by ChEMBL
LigandPNGBDBM50324869(CHEMBL1222135 | naphthalene-2-sulfonic acid isopro...)
Affinity DataIC50:  1.72E+3nM. Assay description: Displacement of [3H]mesulergine from human 5HT2C expressed in CHOKI cells
In DepthDetails ArticlePubMed
Target5-hydroxytryptamine receptor 6(Homo sapiens (Human))
Korea Research Institute Of Chemical Technology
Curated by ChEMBL
LigandPNGBDBM50324869(CHEMBL1222135 | naphthalene-2-sulfonic acid isopro...)
Affinity DataIC50:  27nM. Assay description: Displacement of [3H]LSD from human 5HT6 receptor expressed in HEK293 cells
In DepthDetails ArticlePubMed