BDBM50325003 (R)-5-(4-(5-chloro-6-oxo-1,6-dihydropyridin-3-yl)phenyl)-5-((6-fluoro-1-oxoisoindolin-2-yl)methyl)imidazolidine-2,4-dione::CHEMBL1222942
SMILES Fc1ccc2CN(C[C@]3(NC(=O)NC3=O)c3ccc(cc3)-c3c[nH]c(=O)c(Cl)c3)C(=O)c2c1
InChI Key InChIKey=HAVNLPXQZUUFQA-QHCPKHFHSA-N
Data  1 KI
  Tab Delimited (TSV)   2D SDfile   Computed 3D by Vconf -m prep SDfile
Find this compound or compounds like it in BindingDB:
Activity Spreadsheet -- Enzyme Inhibition Constant Data from BindingDB
Found 1 hit for monomerid = 50325003
TargetDisintegrin and metalloproteinase domain-containing protein 17(Homo sapiens (Human))
Merck Research Laboratories
Curated by ChEMBL
LigandPNGBDBM50325003((R)-5-(4-(5-chloro-6-oxo-1,6-dihydropyridin-3-yl)p...)
Affinity DataKi:  0.100nM. Assay description: Inhibition of TACE assessed as inhibition of pro-TNFalpha peptide cleavage
In DepthDetails ArticlePubMed