BDBM50325743 CHEMBL271989::N-(4-(4-(2-methoxyphenyl)piperazin-1-yl)butyl)quinolin-2-amine
SMILES COc1ccccc1N1CCN(CCCCNc2ccc3ccccc3n2)CC1
InChI Key InChIKey=SVLOMAHKFFJJIC-UHFFFAOYSA-N
Data  4 KI
  Tab Delimited (TSV)   2D SDfile   Computed 3D by Vconf -m prep SDfile
Find this compound or compounds like it in BindingDB:
Activity Spreadsheet -- Enzyme Inhibition Constant Data from BindingDB
Found 4 hits for monomerid = 50325743
TargetD(2) dopamine receptor(Homo sapiens (Human))
Université
Curated by ChEMBL
LigandPNGBDBM50325743(CHEMBL271989 | N-(4-(4-(2-methoxyphenyl)piperazin-...)
Affinity DataKi:  5.60nM. Assay description: Displacement of [3H]spiperone from human dopamine D2S receptor expressed in HEK293 cells
In DepthDetails ArticlePubMed
TargetAlpha-1A adrenergic receptor(Homo sapiens (Human))
Université
Curated by ChEMBL
LigandPNGBDBM50325743(CHEMBL271989 | N-(4-(4-(2-methoxyphenyl)piperazin-...)
Affinity DataKi:  6nM. Assay description: Displacement of [3H]prazosin from human adrenergic alpha1A receptor
In DepthDetails ArticlePubMed
TargetD(3) dopamine receptor(Homo sapiens (Human))
Université
Curated by ChEMBL
LigandPNGBDBM50325743(CHEMBL271989 | N-(4-(4-(2-methoxyphenyl)piperazin-...)
Affinity DataKi:  15nM. Assay description: Displacement of [3H]spiperone from human dopamine D3 receptor expressed in CHO cells
In DepthDetails ArticlePubMed
Target5-hydroxytryptamine receptor 1A(Homo sapiens (Human))
Universita Degli Studi Di Bari
Curated by ChEMBL
LigandPNGBDBM50325743(CHEMBL271989 | N-(4-(4-(2-methoxyphenyl)piperazin-...)
Affinity DataKi:  97nM. Assay description: Displacement of [3H]8-OH-DPAT from human 5HT1A receptor expressed in HEK293 cells after 120 mins
In DepthDetails ArticlePubMed