BDBM50325891 CHEMBL1224612::N-(1-((6-(4-fluoro-2-methoxyphenyl)pyridin-2-yl)methyl)-1H-indol-6-yl)-3-hydroxy-3-methylbutanamide
SMILES COc1cc(F)ccc1-c1cccc(Cn2ccc3ccc(NC(=O)CC(C)(C)O)cc23)n1
InChI Key InChIKey=KJVMIKLNUFIUIG-UHFFFAOYSA-N
Data  1 IC50
  Tab Delimited (TSV)   2D SDfile   Computed 3D by Vconf -m prep SDfile
Find this compound or compounds like it in BindingDB:
Activity Spreadsheet -- Enzyme Inhibition Constant Data from BindingDB
Found 1 hit for monomerid = 50325891
TargetCannabinoid receptor 1(Homo sapiens (Human))
Ligand Pharmaceuticals
Curated by ChEMBL
LigandPNGBDBM50325891(CHEMBL1224612 | N-(1-((6-(4-fluoro-2-methoxyphenyl...)
Affinity DataIC50:  23nM. Assay description: Displacement of [3H]CC55940 human cannabinoid CB1 receptor expressed in CHO cells by luciferase reporter gene assay
In DepthDetails ArticlePubMed