BDBM50326527 (4-bromophenyl)(4-(methylsulfonyl)phenyl)methanone::CHEMBL1240922
SMILES CS(=O)(=O)c1ccc(cc1)C(=O)c1ccc(Br)cc1
InChI Key InChIKey=MDJBMCZZYBLPTR-UHFFFAOYSA-N
Data  2 IC50
  Tab Delimited (TSV)   2D SDfile   Computed 3D by Vconf -m prep SDfile
Find this compound or compounds like it in BindingDB:
Activity Spreadsheet -- Enzyme Inhibition Constant Data from BindingDB
Found 2 hits for monomerid = 50326527
TargetProstaglandin G/H synthase 2(Ovis aries (Sheep))
Universitat De Barcelona
Curated by ChEMBL
LigandPNGBDBM50326527((4-bromophenyl)(4-(methylsulfonyl)phenyl)methanone...)
Affinity DataIC50:  1.00E+3nM. Assay description: Inhibition of sheep COX2 by spectrophotometry
In DepthDetails ArticlePubMed
TargetProstaglandin G/H synthase 1(Ovis aries (Sheep))
Universitat De Barcelona
Curated by ChEMBL
LigandPNGBDBM50326527((4-bromophenyl)(4-(methylsulfonyl)phenyl)methanone...)
Affinity DataIC50:  1.50E+5nM. Assay description: Inhibition of sheep COX1 by spectrophotometry
In DepthDetails ArticlePubMed