BDBM50328487 1-Methyl-4-(8-(pyridin-4-yl)-10,11-dihydrodibenzo[b,f]thiepin-10-yl)piperazine::CHEMBL1259024
SMILES CN1CCN(CC1)C1Cc2ccccc2Sc2ccc(cc12)-c1ccncc1
InChI Key InChIKey=UJKKBRMKWCZNQF-UHFFFAOYSA-N
Data  4 KI
  Tab Delimited (TSV)   2D SDfile   Computed 3D by Vconf -m prep SDfile
Find this compound or compounds like it in BindingDB:
Activity Spreadsheet -- Enzyme Inhibition Constant Data from BindingDB
Found 4 hits for monomerid = 50328487
TargetAlpha-1D adrenergic receptor(Rattus norvegicus (Rat))
University Of Copenhagen
Curated by ChEMBL
LigandPNGBDBM50328487(1-Methyl-4-(8-(pyridin-4-yl)-10,11-dihydrodibenzo[...)
Affinity DataKi:  0.660nM. Assay description: Displacement of [3H]prozosin from rat cloned alpha1d receptor
In DepthDetails ArticlePubMed
TargetD(2) dopamine receptor(Homo sapiens (Human))
University Of Copenhagen
Curated by ChEMBL
LigandPNGBDBM50328487(1-Methyl-4-(8-(pyridin-4-yl)-10,11-dihydrodibenzo[...)
Affinity DataKi:  1.10nM. Assay description: Displacement of [3H]prozosin from human cloned dopamine D2 receptor expressed in CHO cells
In DepthDetails ArticlePubMed
TargetAlpha-1A adrenergic receptor(CALF)
University Of Copenhagen
Curated by ChEMBL
LigandPNGBDBM50328487(1-Methyl-4-(8-(pyridin-4-yl)-10,11-dihydrodibenzo[...)
Affinity DataKi:  1.5nM. Assay description: Displacement of [3H]prozosin from bovine cloned alpha1a receptor expressed in BHK cells
In DepthDetails ArticlePubMed
TargetAlpha-1B adrenergic receptor(C.H.O.)
University Of Copenhagen
Curated by ChEMBL
LigandPNGBDBM50328487(1-Methyl-4-(8-(pyridin-4-yl)-10,11-dihydrodibenzo[...)
Affinity DataKi:  1.90nM. Assay description: Displacement of [3H]prozosin from hamster cloned alpha1b receptor
In DepthDetails ArticlePubMed