BDBM50329556 (R)-2-amino-4-(4-(difluoromethoxy)phenyl)-4-(3-(6-hydroxyhex-1-ynyl)phenyl)-1-methyl-1H-imidazol-5(4H)-one::CHEMBL1269921
SMILES CN1C(N)=N[C@](C1=O)(c1ccc(OC(F)F)cc1)c1cccc(c1)C#CCCCCO
InChI Key InChIKey=WBFOZABJJNJWHS-HSZRJFAPSA-N
Data  1 IC50  1 EC50
  Tab Delimited (TSV)   2D SDfile   Computed 3D by Vconf -m prep SDfile
Find this compound or compounds like it in BindingDB:
Activity Spreadsheet -- Enzyme Inhibition Constant Data from BindingDB
Found 2 hits for monomerid = 50329556
TargetBeta-secretase 1(Homo sapiens (Human))
Pfizer
Curated by ChEMBL
LigandPNGBDBM50329556((R)-2-amino-4-(4-(difluoromethoxy)phenyl)-4-(3-(6-...)
Affinity DataEC50:  20nM. Assay description: Inhibition of human recombinant BACE1 expressed in CHO cells assessed as reduction in amyloid beta level by sandwich ELISA
In DepthDetails ArticlePubMed
TargetBeta-secretase 1(Homo sapiens (Human))
Pfizer
Curated by ChEMBL
LigandPNGBDBM50329556((R)-2-amino-4-(4-(difluoromethoxy)phenyl)-4-(3-(6-...)
Affinity DataIC50:  10nM. Assay description: Inhibition of human BACE1 by FRET assay
In DepthDetails ArticlePubMed