BDBM50329617 CHEMBL1270636::ethyl(1R,3aR,4aR,6R,8aR,9S,9aS)-9-((E)-2-(5-(2-methoxyphenyl)pyridin-2-yl)vinyl)-1-methyl-3-oxododecahydronaphtho[2,3-c]furan-6-ylcarbamate
SMILES CCOC(=O)N[C@@H]1CC[C@@H]2[C@H](C[C@@H]3[C@@H]([C@@H](C)OC3=O)[C@H]2C=Cc2ccc(cn2)-c2ccccc2OC)C1
InChI Key InChIKey=FXGKWUFRBYJDLB-GOVGUOIOSA-N
Data  1 KI
  Tab Delimited (TSV)   2D SDfile   Computed 3D by Vconf -m prep SDfile
Find this compound or compounds like it in BindingDB:
Activity Spreadsheet -- Enzyme Inhibition Constant Data from BindingDB
Found 1 hit for monomerid = 50329617
TargetProteinase-activated receptor 1(Homo sapiens (Human))
Merck Research Laboratories
Curated by ChEMBL
LigandPNGBDBM50329617(CHEMBL1270636 | ethyl(1R,3aR,4aR,6R,8aR,9S,9aS)-9-...)
Affinity DataKi:  12nM. Assay description: Displacement of high affinity TRAP form human platelet PAR1
In DepthDetails ArticlePubMed