BDBM50329686 CHEMBL1269296
SMILES [#6]C([#6])([#6]-[#7]-[#6](=O)-[#8]-[#6]-[#6]-[#8]-[#6]-[#6]-[#8]-[#6]-[#6]-[#8]-[#6]-[#6]-[#8]-[#6](=O)-[#7]-[#6]C([#6])([#6])[#6]-[#8]-[#6](=O)-[#7]-[#6]-[#6]S(=O)(=O)[#7]-[#6@@H](-[#6]-[#7]-[#6](=O)-c1ccc(-[#8]-[#6]-[#6]\[#7]=[#6]-2/[#7]-[#6]-[#6]-[#6]-[#7]-2)cc1)-[#6](-[#8])=O)[#6]-[#8]-[#6](=O)-[#7]-[#6]-[#6]S(=O)(=O)[#7]-[#6@@H](-[#6]-[#7]-[#6](=O)-c1ccc(-[#8]-[#6]-[#6]\[#7]=[#6]-2\[#7]-[#6]-[#6]-[#6]-[#7]-2)cc1)-[#6](-[#8])=O
InChI Key InChIKey=KSQUEZUEYFZRQY-ZYBCLOSLSA-N
Data  1 IC50
  Tab Delimited (TSV)   2D SDfile   Computed 3D by Vconf -m prep SDfile
Find this compound or compounds like it in BindingDB:
Activity Spreadsheet -- Enzyme Inhibition Constant Data from BindingDB
Found 1 hit for monomerid = 50329686
TargetIntegrin alpha-V/beta-3(Homo sapiens (Human))
The Methodist Hospital Research Institute
Curated by ChEMBL
LigandPNGBDBM50329686(CHEMBL1269296)
Affinity DataIC50:  0.110nM. Assay description: Inhibition of biotinylated vitronectin binding to human alphaVbeta3 integrin after 3 hrs by ELISA
In DepthDetails ArticlePubMed