BDBM50329694 Bis(3,4-dihydroxyphenyl)methanone::CHEMBL1269420::hCA inhibitor, 3
SMILES Oc1ccc(cc1O)C(=O)c1ccc(O)c(O)c1
InChI Key InChIKey=XZXMWAHILBWKBI-UHFFFAOYSA-N
Data  3 KI  1 IC50
  Tab Delimited (TSV)   2D SDfile   Computed 3D by Vconf -m prep SDfile
Find this compound or compounds like it in BindingDB:
Activity Spreadsheet -- Enzyme Inhibition Constant Data from BindingDB
Found 4 hits for monomerid = 50329694
TargetCarbonic anhydrase 2(Homo sapiens (Human))
Artvin Coruh University
LigandPNGBDBM50329694(Bis(3,4-dihydroxyphenyl)methanone | CHEMBL1269420 ...)
Affinity DataKi:  1.44E+3nMpH: 7.4Assay Description:CA activity was assayed by following the change in absorbance at 348 nm of 4-NPA to 4-nitrophenylate ion over a period of 3 min at 25°C using a spect...
In DepthDetails ArticlePubMed
TargetCarbonic anhydrase 6(Homo sapiens (Human))
Artvin Coruh University
LigandPNGBDBM50329694(Bis(3,4-dihydroxyphenyl)methanone | CHEMBL1269420 ...)
Affinity DataKi:  1.14E+4nMpH: 7.4Assay Description:CA activity was assayed by following the change in absorbance at 348 nm of 4-NPA to 4-nitrophenylate ion over a period of 3 min at 25°C using a spect...
In DepthDetails ArticlePubMed
TargetCarbonic anhydrase 1(Homo sapiens (Human))
Artvin Coruh University
LigandPNGBDBM50329694(Bis(3,4-dihydroxyphenyl)methanone | CHEMBL1269420 ...)
Affinity DataKi:  1.80E+4nMpH: 7.4Assay Description:CA activity was assayed by following the change in absorbance at 348 nm of 4-NPA to 4-nitrophenylate ion over a period of 3 min at 25°C using a spect...
In DepthDetails ArticlePubMed
TargetIsocitrate lyase(Candida albicans)
Seoul National University
Curated by ChEMBL
LigandPNGBDBM50329694(Bis(3,4-dihydroxyphenyl)methanone | CHEMBL1269420 ...)
Affinity DataIC50:  2.26E+4nM. Assay description: Inhibition of Candida albicans ATCC 10231 isocitrate lyase
In DepthDetails ArticlePubMed