BDBM50329696 (3-Bromo-4,5-dihydroxyphenyl)(2,3-dibromo-4,5-dihydroxyphenyl)methanone::CHEMBL1269936
SMILES Oc1cc(cc(Br)c1O)C(=O)c1cc(O)c(O)c(Br)c1Br
InChI Key InChIKey=WXZOYPSWICPUSA-UHFFFAOYSA-N
Data  1 IC50
  Tab Delimited (TSV)   2D SDfile   Computed 3D by Vconf -m prep SDfile
Find this compound or compounds like it in BindingDB:
Activity Spreadsheet -- Enzyme Inhibition Constant Data from BindingDB
Found 1 hit for monomerid = 50329696
TargetIsocitrate lyase(Candida albicans)
Seoul National University
Curated by ChEMBL
LigandPNGBDBM50329696((3-Bromo-4,5-dihydroxyphenyl)(2,3-dibromo-4,5-dihy...)
Affinity DataIC50:  2.65E+3nM. Assay description: Inhibition of Candida albicans ATCC 10231 isocitrate lyase
In DepthDetails ArticlePubMed