BDBM50331242 2-(4-chloro-2-fluorophenyl)-5-(1-(2-(pyrrolidin-1-yl)ethyl)-1H-indazol-5-yl)furo[3,2-c]pyridin-4(5H)-one::CHEMBL1290602
SMILES Fc1cc(Cl)ccc1-c1cc2c(ccn(-c3ccc4n(CCN5CCCC5)ncc4c3)c2=O)o1
InChI Key InChIKey=JXVQDWHASUVZIZ-UHFFFAOYSA-N
Data  1 KI
  Tab Delimited (TSV)   2D SDfile   Computed 3D by Vconf -m prep SDfile
Find this compound or compounds like it in BindingDB:
Activity Spreadsheet -- Enzyme Inhibition Constant Data from BindingDB
Found 1 hit for monomerid = 50331242
TargetMelanin-concentrating hormone receptor 1(Homo sapiens (Human))
Amri
Curated by ChEMBL
LigandPNGBDBM50331242(2-(4-chloro-2-fluorophenyl)-5-(1-(2-(pyrrolidin-1-...)
Affinity DataKi:  4.20nM. Assay description: Displacement of [3H]4-(benzyloxy)-1-(1-(2-(pyrrolidin-1-yl)ethyl)-1H-indazol-5-yl)pyridin-2(1H)-one from MCH-1 receptor expressed in CHO-K1 cells
In DepthDetails ArticlePubMed