BDBM503321 6-Amino-2-(4-amino-4-methyl- piperidin-1-yl)-5-(2,3-dichloro- phenyl)-pyrimidine-4-carboxylic acid hydrazide::US11033547, Compound 21::US11696916, Compound 21
SMILES CC1(N)CCN(CC1)c1nc(N)c(-c2cccc(Cl)c2Cl)c(n1)C(=O)NN
InChI Key InChIKey=OYYCMKZHVREVIU-UHFFFAOYSA-N
Data  2 IC50
  Tab Delimited (TSV)   2D SDfile   Computed 3D by Vconf -m prep SDfile
Find this compound or compounds like it in BindingDB:
Activity Spreadsheet -- Enzyme Inhibition Constant Data from BindingDB
Found 2 hits for monomerid = 503321
TargetTyrosine-protein phosphatase non-receptor type 11(Homo sapiens)
Merck Patent
US Patent
LigandPNGBDBM503321(6-Amino-2-(4-amino-4-methyl- piperidin-1-yl)-5-(2,...)
Affinity DataIC50:  1.60E+3nM. Assay description: The inhibition of SHP2 by compounds of the invention was monitored using the surrogate substrate DiFMUP after protein activation by a peptide bearing...
Ligand InfoPC cidPC sid
In DepthDetails US Patent
TargetTyrosine-protein phosphatase non-receptor type 11(Homo sapiens (Human))
Merck Patent
US Patent
LigandPNGBDBM503321(6-Amino-2-(4-amino-4-methyl- piperidin-1-yl)-5-(2,...)
Affinity DataIC50:  1.60E+3nM. Assay description: The inhibition of SHP2 by compounds of the invention was monitored using the surrogate substrate DiFMUP after protein activation by a peptide bearing...
Ligand InfoPC cidPC sid
In DepthDetails US Patent