BDBM50332278 (R)-5-((1H-indol-5-yl)ethynyl)-5-((6-methoxy-1-oxoisoindolin-2-yl)methyl)imidazolidine-2,4-dione::CHEMBL1288241
SMILES COc1ccc2CN(C[C@]3(NC(=O)NC3=O)C#Cc3ccc4[nH]ccc4c3)C(=O)c2c1
InChI Key InChIKey=JVSTYSFDPAVLLJ-HSZRJFAPSA-N
Data  1 KI
  Tab Delimited (TSV)   2D SDfile   Computed 3D by Vconf -m prep SDfile
Find this compound or compounds like it in BindingDB:
Activity Spreadsheet -- Enzyme Inhibition Constant Data from BindingDB
Found 1 hit for monomerid = 50332278
TargetDisintegrin and metalloproteinase domain-containing protein 17(Homo sapiens (Human))
Merck Research Laboratories
Curated by ChEMBL
LigandPNGBDBM50332278((R)-5-((1H-indol-5-yl)ethynyl)-5-((6-methoxy-1-oxo...)
Affinity DataKi:  0.170nM. Assay description: Inhibition of TACE
In DepthDetails ArticlePubMed