BDBM50332305 CHEMBL1288062::ethyl 3-(5-amino-1-(2-fluorobenzoyl)-1H-1,2,4-triazol-3-ylamino)benzoate
SMILES CCOC(=O)c1cccc(Nc2nc(N)n(n2)C(=O)c2ccccc2F)c1
InChI Key InChIKey=XUADBUYNWROMGU-UHFFFAOYSA-N
Data  3 IC50
  Tab Delimited (TSV)   2D SDfile   Computed 3D by Vconf -m prep SDfile
Find this compound or compounds like it in BindingDB:
Activity Spreadsheet -- Enzyme Inhibition Constant Data from BindingDB
Found 3 hits for monomerid = 50332305
TargetTyrosine-protein kinase JAK2(Homo sapiens (Human))
Sri International
Curated by ChEMBL
LigandPNGBDBM50332305(CHEMBL1288062 | ethyl 3-(5-amino-1-(2-fluorobenzoy...)
Affinity DataIC50: >1.00E+4nM. Assay description: Inhibition of human recombinant JAK2 by TR-FRET assay
In DepthDetails ArticlePubMed
TargetNon-receptor tyrosine-protein kinase TYK2(Homo sapiens (Human))
Sri International
Curated by ChEMBL
LigandPNGBDBM50332305(CHEMBL1288062 | ethyl 3-(5-amino-1-(2-fluorobenzoy...)
Affinity DataIC50:  6.04E+3nM. Assay description: Inhibition of human recombinant TYK2 by TR-FRET assay
In DepthDetails ArticlePubMed
TargetTyrosine-protein kinase JAK3(Homo sapiens (Human))
Sri International
Curated by ChEMBL
LigandPNGBDBM50332305(CHEMBL1288062 | ethyl 3-(5-amino-1-(2-fluorobenzoy...)
Affinity DataIC50: >1.00E+4nM. Assay description: Inhibition of human recombinant JAK3 by TR-FRET assay
In DepthDetails ArticlePubMed