BDBM50332570 5-fluoro-3-(3-(4-methylpiperazin-1-yl)propyl)-1H-indole::CHEMBL1630740
SMILES CN1CCN(CCCc2c[nH]c3ccc(F)cc23)CC1
InChI Key InChIKey=LTTKAOBFCJWJLA-UHFFFAOYSA-N
Data  2 IC50
  Tab Delimited (TSV)   2D SDfile   Computed 3D by Vconf -m prep SDfile
Find this compound or compounds like it in BindingDB:
Activity Spreadsheet -- Enzyme Inhibition Constant Data from BindingDB
Found 2 hits for monomerid = 50332570
TargetMyeloperoxidase(Homo sapiens (Human))
Universite£? Libre De Bruxelles
Curated by ChEMBL
LigandPNGBDBM50332570(5-fluoro-3-(3-(4-methylpiperazin-1-yl)propyl)-1H-i...)
Affinity DataIC50:  310nM. Assay description: Inhibition of recombinant MPO mediated LDL oxidation using MPO/Cl-/H2O2 system
In DepthDetails ArticlePubMed
TargetMyeloperoxidase(Homo sapiens (Human))
Universite£? Libre De Bruxelles
Curated by ChEMBL
LigandPNGBDBM50332570(5-fluoro-3-(3-(4-methylpiperazin-1-yl)propyl)-1H-i...)
Affinity DataIC50:  350nM. Assay description: Inhibition of recombinant MPO mediated taurine chlorination by microplate reader method
In DepthDetails ArticlePubMed