BDBM50333404 3-(R)-(2-{[(S)-2-((S)-2-{(S)-2-Amino-3-[(2H-tetrazole-5-carbonyl)-amino]-propionylamino}-3-methyl-butyrylamino)-4-methyl-pentanoylamino]-methyl}-2-hydroxy-4-phenyl-butyrylamino)-benzoic acid::3-[[(2S)-2-[[[(2S)-2-[[(2S)-2-[[(2S)-2-azanyl-3-(1H-1,2,3,4-tetrazol-5-ylcarbonylamino)propanoyl]amino]-3-methyl-butanoyl]amino]-4-methyl-pentanoyl]amino]methyl]-2-hydroxy-4-phenyl-butanoyl]amino]benzoic acid::CHEMBL1229518
SMILES CC(C)C[C@H](NC(=O)[C@@H](NC(=O)[C@@H](N)CNC(=O)c1nnn[nH]1)C(C)C)C(=O)NC[C@](O)(CCc1ccccc1)C(=O)Nc1cccc(c1)C(O)=O
InChI Key InChIKey=FZZOBXKGDCMGAL-NAJARDBOSA-N
Data  1 IC50
PDB links: 1 PDB ID matches this monomer.
  Tab Delimited (TSV)   2D SDfile   Computed 3D by Vconf -m prep SDfile
Find this compound or compounds like it in BindingDB:
Activity Spreadsheet -- Enzyme Inhibition Constant Data from BindingDB
Found 1 hit for monomerid = 50333404
TargetBeta-secretase 1(Homo sapiens (Human))
Uppsala University
Curated by ChEMBL
LigandPNGBDBM50333404(3-(R)-(2-{[(S)-2-((S)-2-{(S)-2-Amino-3-[(2H-tetraz...)
Affinity DataIC50:  190nM. Assay description: Inhibition of BACE1