BDBM50333885 (S)-N-((1H-benzo[d]imidazol-2-yl)methyl)-N-(4-(aminomethyl)furan-3-yl)-5,6,7,8-tetrahydroquinolin-8-amine::CHEMBL1644082
SMILES NCc1cocc1N(Cc1nc2ccccc2[nH]1)[C@H]1CCCc2cccnc12
InChI Key InChIKey=ZYRYBBGMNLVUJU-IBGZPJMESA-N
Data  2 IC50
  Tab Delimited (TSV)   2D SDfile   Computed 3D by Vconf -m prep SDfile
Find this compound or compounds like it in BindingDB:
Activity Spreadsheet -- Enzyme Inhibition Constant Data from BindingDB
Found 2 hits for monomerid = 50333885
TargetC-X-C chemokine receptor type 4(Homo sapiens (Human))
Genzyme
Curated by ChEMBL
LigandPNGBDBM50333885((S)-N-((1H-benzo[d]imidazol-2-yl)methyl)-N-(4-(ami...)
Affinity DataIC50:  25nM. Assay description: Antagonist activity at CXCR4 in human CEM-CCRF cells expressing CD4 assessed as inhibition of SDF-1-induced Ca2+ signaling
In DepthDetails ArticlePubMed
TargetC-X-C chemokine receptor type 4(Homo sapiens (Human))
Genzyme
Curated by ChEMBL
LigandPNGBDBM50333885((S)-N-((1H-benzo[d]imidazol-2-yl)methyl)-N-(4-(ami...)
Affinity DataIC50:  44.5nM. Assay description: Displacement of [125I]SDF-1 from CXCR4 in human CEM-CCRF cells expressing CD4 by liquid scintillation counting
In DepthDetails ArticlePubMed