BDBM50334436 CHEMBL1643878::N-((2R,4S)-2-butyl-4-(3-(2-fluorophenyl)ureido)-5-methyl-3-oxohexyl)-N-hydroxyformamide
SMILES CCCC[C@H](CN(O)C=O)C(=O)[C@@H](NC(=O)Nc1ccccc1F)C(C)C
InChI Key InChIKey=OWFALUNDSZEADU-PBHICJAKSA-N
Data  1 IC50
PDB links: 1 PDB ID matches this monomer.
  Tab Delimited (TSV)   2D SDfile   Computed 3D by Vconf -m prep SDfile
Find this compound or compounds like it in BindingDB:
Activity Spreadsheet -- Enzyme Inhibition Constant Data from BindingDB
Found 1 hit for monomerid = 50334436
TargetPeptide deformylase(Pseudomonas aeruginosa)
Seoul National University
Curated by ChEMBL
LigandPNGBDBM50334436(CHEMBL1643878 | N-((2R,4S)-2-butyl-4-(3-(2-fluorop...)
Affinity DataIC50:  41nM. Assay description: Inhibition of Pseudomonas aeruginosa peptide deformylase after 10 mins by fluorescence assay
In DepthDetails ArticlePubMed