BDBM50334458 CHEMBL1643901::N-(3-Fluorobenzyl)-N-methyl-8-aminopentacyclo[5.4.0.02,6.03,10.05,9]undecane
SMILES CN(Cc1cccc(F)c1)[C@@H]1C2C3CC4C5CC(C2C35)C14
InChI Key InChIKey=GACBJAOXQGFNDL-RAOGCBAWSA-N
Data  4 KI
  Tab Delimited (TSV)   2D SDfile   Computed 3D by Vconf -m prep SDfile
Find this compound or compounds like it in BindingDB:
Activity Spreadsheet -- Enzyme Inhibition Constant Data from BindingDB
Found 4 hits for monomerid = 50334458
TargetSodium-dependent dopamine transporter(Homo sapiens (Human))
The University Of Sydney
Curated by ChEMBL
LigandPNGBDBM50334458(CHEMBL1643901 | N-(3-Fluorobenzyl)-N-methyl-8-amin...)
Affinity DataKi:  1.20nM. Assay description: Displacement of [3H]WIN-35428 form human DAT expressed in HEK cell membranes
In DepthDetails ArticlePubMed
TargetSigma non-opioid intracellular receptor 1(RAT)
The University Of Sydney
Curated by ChEMBL
LigandPNGBDBM50334458(CHEMBL1643901 | N-(3-Fluorobenzyl)-N-methyl-8-amin...)
Affinity DataKi:  1.57E+3nM. Assay description: Displacement of (+)-[3H]pentazocine from sigma 1 receptor in rat PC12 cells
In DepthDetails ArticlePubMed
TargetHistamine H1 receptor(Homo sapiens (Human))
The University Of Sydney
Curated by ChEMBL
LigandPNGBDBM50334458(CHEMBL1643901 | N-(3-Fluorobenzyl)-N-methyl-8-amin...)
Affinity DataKi: >1.00E+4nM. Assay description: Inhibition of histamine H1 receptor (unknown origin) by PDSP assay
In DepthDetails ArticlePubMed
TargetD(1B) dopamine receptor(Homo sapiens (Human))
The University Of Sydney
Curated by ChEMBL
LigandPNGBDBM50334458(CHEMBL1643901 | N-(3-Fluorobenzyl)-N-methyl-8-amin...)
Affinity DataKi: >1.00E+4nM. Assay description: Inhibition of dopamine D5 receptor
In DepthDetails ArticlePubMed