BDBM50334544 (S)-N-(4-(2-aminoethyl)-4,5-dihydro-1H-imidazol-2-yl)pyridin-3-amine dihydrobromide::CHEMBL1644494
SMILES NCC[C@H]1CN=C(Nc2cccnc2)N1
InChI Key InChIKey=CVWCWWMXURGMEP-VIFPVBQESA-N
Data  1 IC50
  Tab Delimited (TSV)   2D SDfile   Computed 3D by Vconf -m prep SDfile
Find this compound or compounds like it in BindingDB:
Activity Spreadsheet -- Enzyme Inhibition Constant Data from BindingDB
Found 1 hit for monomerid = 50334544
TargetNischarin(RAT)
Gdansk University Of Technology
Curated by ChEMBL
LigandPNGBDBM50334544((S)-N-(4-(2-aminoethyl)-4,5-dihydro-1H-imidazol-2-...)
Affinity DataIC50: >1.00E+6nM. Assay description: Inhibition of Sprague-Dawley rat imidazoline I1 receptor
In DepthDetails ArticlePubMed