BDBM50334734 3-(Naphthalen-2-ylsulfonyl)-N-(piperidin-4-yl)-1H-indazol-5-amine HCl::CHEMBL1642889
SMILES O=S(=O)(c1n[nH]c2ccc(NC3CCNCC3)cc12)c1ccc2ccccc2c1
InChI Key InChIKey=DVEBXLWTIWPHPE-UHFFFAOYSA-N
Data  9 KI  1 IC50
  Tab Delimited (TSV)   2D SDfile   Computed 3D by Vconf -m prep SDfile
Find this compound or compounds like it in BindingDB:
Activity Spreadsheet -- Enzyme Inhibition Constant Data from BindingDB
Found 10 hits for monomerid = 50334734
Target5-hydroxytryptamine receptor 6(Homo sapiens (Human))
Wyeth Research
Curated by ChEMBL
LigandPNGBDBM50334734(3-(Naphthalen-2-ylsulfonyl)-N-(piperidin-4-yl)-1H-...)
Affinity DataKi:  0.600nM. Assay description: Displacement of [3H]-LSD from cloned human 5-HT6 receptor expressed in human HeLa cells
In DepthDetails ArticlePubMed
Target5-hydroxytryptamine receptor 2B(Homo sapiens (Human))
Wyeth Research
Curated by ChEMBL
LigandPNGBDBM50334734(3-(Naphthalen-2-ylsulfonyl)-N-(piperidin-4-yl)-1H-...)
Affinity DataKi:  675nM. Assay description: Binding affinity to 5-HT2B receptor
In DepthDetails ArticlePubMed
Target5-hydroxytryptamine receptor 1A(Homo sapiens (Human))
Wyeth Research
Curated by ChEMBL
LigandPNGBDBM50334734(3-(Naphthalen-2-ylsulfonyl)-N-(piperidin-4-yl)-1H-...)
Affinity DataKi:  4.35E+3nM. Assay description: Binding affinity to 5-HT1A receptor
In DepthDetails ArticlePubMed
Target5-hydroxytryptamine receptor 1B(Homo sapiens (Human))
Wyeth Research
Curated by ChEMBL
LigandPNGBDBM50334734(3-(Naphthalen-2-ylsulfonyl)-N-(piperidin-4-yl)-1H-...)
Affinity DataKi: >5.00E+3nM. Assay description: Binding affinity to 5-HT1B receptor
In DepthDetails ArticlePubMed
Target5-hydroxytryptamine receptor 1D(Homo sapiens (Human))
Wyeth Research
Curated by ChEMBL
LigandPNGBDBM50334734(3-(Naphthalen-2-ylsulfonyl)-N-(piperidin-4-yl)-1H-...)
Affinity DataKi: >5.00E+3nM. Assay description: Binding affinity to 5-HT1D receptor
In DepthDetails ArticlePubMed
Target5-hydroxytryptamine receptor 2C(Homo sapiens (Human))
Wyeth Research
Curated by ChEMBL
LigandPNGBDBM50334734(3-(Naphthalen-2-ylsulfonyl)-N-(piperidin-4-yl)-1H-...)
Affinity DataKi: >5.00E+3nM. Assay description: Binding affinity to 5-HT2C receptor
In DepthDetails ArticlePubMed
Target5-hydroxytryptamine receptor 7(Homo sapiens (Human))
Wyeth Research
Curated by ChEMBL
LigandPNGBDBM50334734(3-(Naphthalen-2-ylsulfonyl)-N-(piperidin-4-yl)-1H-...)
Affinity DataKi: >5.00E+3nM. Assay description: Binding affinity to 5-HT7 receptor
In DepthDetails ArticlePubMed
TargetAlpha-2A adrenergic receptor(Homo sapiens (Human))
Wyeth Research
Curated by ChEMBL
LigandPNGBDBM50334734(3-(Naphthalen-2-ylsulfonyl)-N-(piperidin-4-yl)-1H-...)
Affinity DataKi: >5.00E+3nM. Assay description: Binding affinity to adrenergic alpha2A receptor
In DepthDetails ArticlePubMed
TargetD(2) dopamine receptor(Homo sapiens (Human))
Wyeth Research
Curated by ChEMBL
LigandPNGBDBM50334734(3-(Naphthalen-2-ylsulfonyl)-N-(piperidin-4-yl)-1H-...)
Affinity DataKi: >5.00E+3nM. Assay description: Binding affinity to dopamine D2 receptor
In DepthDetails ArticlePubMed
Target5-hydroxytryptamine receptor 6(Homo sapiens (Human))
Wyeth Research
Curated by ChEMBL
LigandPNGBDBM50334734(3-(Naphthalen-2-ylsulfonyl)-N-(piperidin-4-yl)-1H-...)
Affinity DataIC50:  16nM. Assay description: Antagonist activity at cloned human 5-HT6 receptor expressed in human HeLa cells assessed as inhibition of 5HT-induced cyclic AMP formation
In DepthDetails ArticlePubMed