BDBM50334993 (S)-2-amino-3-(4-hydroxy-2,6-dimethylphenyl)-N-((R)-1-oxo-1-((S)-1-oxo-3-phenyl-1-(4-(N-phenylpropionamido)piperidin-1-yl)propan-2-ylamino)propan-2-yl)propanamide::CHEMBL1649940
SMILES CCC(=O)N(C1CCN(CC1)C(=O)[C@H](Cc1ccccc1)NC(=O)[C@@H](C)NC(=O)[C@@H](N)Cc1c(C)cc(O)cc1C)c1ccccc1
InChI Key InChIKey=XYWSGXJRLJYNDA-DJDPXSJISA-N
Data  1 KI  3 IC50  2 EC50
  Tab Delimited (TSV)   2D SDfile   Computed 3D by Vconf -m prep SDfile
Find this compound or compounds like it in BindingDB:
Activity Spreadsheet -- Enzyme Inhibition Constant Data from BindingDB
Found 6 hits for monomerid = 50334993
TargetDelta-type opioid receptor(Homo sapiens (Human))
University Of Arizona
Curated by ChEMBL
LigandPNGBDBM50334993((S)-2-amino-3-(4-hydroxy-2,6-dimethylphenyl)-N-((R...)
Affinity DataKi:  1.70nM. Assay description: Displacement of [3H]DPDPE from human delta opioid receptor expressed in mouse HN9.10 cells
In DepthDetails ArticlePubMed
TargetMu-type opioid receptor(Rattus norvegicus (rat))
University Of Arizona
Curated by ChEMBL
LigandPNGBDBM50334993((S)-2-amino-3-(4-hydroxy-2,6-dimethylphenyl)-N-((R...)
Affinity DataEC50:  0.940nM. Assay description: Agonist activity at rat mu opioid receptor expressed in CHO cells assessed as stimulation of [35S]GTPgammaS binding
In DepthDetails ArticlePubMed
TargetDelta-type opioid receptor(MOUSE)
University Of Arizona
Curated by ChEMBL
LigandPNGBDBM50334993((S)-2-amino-3-(4-hydroxy-2,6-dimethylphenyl)-N-((R...)
Affinity DataIC50:  15nM. Assay description: Agonist activity at delta opioid receptor in mouse vas deferens assessed as inhibition of electrically-stimulated muscle contraction
In DepthDetails ArticlePubMed
TargetMu-type opioid receptor(GUINEA PIG)
University Of Arizona
Curated by ChEMBL
LigandPNGBDBM50334993((S)-2-amino-3-(4-hydroxy-2,6-dimethylphenyl)-N-((R...)
Affinity DataIC50:  3.60nM. Assay description: Agonist activity at mu opioid receptor in guinea pig ileum assessed as inhibition of electrically-stimulated muscle contraction
In DepthDetails ArticlePubMed
TargetMu-type opioid receptor(Rattus norvegicus (rat))
University Of Arizona
Curated by ChEMBL
LigandPNGBDBM50334993((S)-2-amino-3-(4-hydroxy-2,6-dimethylphenyl)-N-((R...)
Affinity DataEC50:  0.940nM. Assay description: Agonist activity at rat mu opioid receptor expressed in CHO cells assessed as stimulation of [35S]GTPgammaS binding
In DepthDetails ArticlePubMed
TargetMu-type opioid receptor(Rattus norvegicus (rat))
University Of Arizona
Curated by ChEMBL
LigandPNGBDBM50334993((S)-2-amino-3-(4-hydroxy-2,6-dimethylphenyl)-N-((R...)
Affinity DataIC50:  0.339nM. Assay description: Displacement of [3H]DAMGO from rat mu opioid receptor expressed in mouse HN9.10 cells
In DepthDetails ArticlePubMed