BDBM50334997 (R)-2-((S)-2-amino-3-(4-hydroxy-2,6-dimethylphenyl)propanamido)-N-((S)-3-(4-chlorophenyl)-1-oxo-1-(4-(N-phenylpropionamido)piperidin-1-yl)propan-2-yl)hexanamide::CHEMBL1649944
SMILES CCCC[C@@H](NC(=O)[C@@H](N)Cc1c(C)cc(O)cc1C)C(=O)N[C@@H](Cc1ccc(Cl)cc1)C(=O)N1CCC(CC1)N(C(=O)CC)c1ccccc1
InChI Key InChIKey=NBCAOCVSBZCMGG-PDHQKIGBSA-N
Data  1 KI  3 IC50  3 EC50
  Tab Delimited (TSV)   2D SDfile   Computed 3D by Vconf -m prep SDfile
Find this compound or compounds like it in BindingDB:
Activity Spreadsheet -- Enzyme Inhibition Constant Data from BindingDB
Found 7 hits for monomerid = 50334997
TargetDelta-type opioid receptor(Homo sapiens (Human))
University Of Arizona
Curated by ChEMBL
LigandPNGBDBM50334997((R)-2-((S)-2-amino-3-(4-hydroxy-2,6-dimethylphenyl...)
Affinity DataKi:  19nM. Assay description: Displacement of [3H]DPDPE from human delta opioid receptor expressed in mouse HN9.10 cells
In DepthDetails ArticlePubMed
TargetMu-type opioid receptor(Rattus norvegicus (rat))
University Of Arizona
Curated by ChEMBL
LigandPNGBDBM50334997((R)-2-((S)-2-amino-3-(4-hydroxy-2,6-dimethylphenyl...)
Affinity DataEC50:  19nM. Assay description: Agonist activity at rat mu opioid receptor expressed in CHO cells assessed as stimulation of [35S]GTPgammaS binding
In DepthDetails ArticlePubMed
TargetMu-type opioid receptor(Rattus norvegicus (rat))
University Of Arizona
Curated by ChEMBL
LigandPNGBDBM50334997((R)-2-((S)-2-amino-3-(4-hydroxy-2,6-dimethylphenyl...)
Affinity DataEC50:  19nM. Assay description: Agonist activity at rat mu opioid receptor expressed in CHO cells assessed as stimulation of [35S]GTPgammaS binding
In DepthDetails ArticlePubMed
TargetDelta-type opioid receptor(MOUSE)
University Of Arizona
Curated by ChEMBL
LigandPNGBDBM50334997((R)-2-((S)-2-amino-3-(4-hydroxy-2,6-dimethylphenyl...)
Affinity DataIC50:  250nM. Assay description: Agonist activity at delta opioid receptor in mouse vas deferens assessed as inhibition of electrically-stimulated muscle contraction
In DepthDetails ArticlePubMed
TargetMu-type opioid receptor(GUINEA PIG)
University Of Arizona
Curated by ChEMBL
LigandPNGBDBM50334997((R)-2-((S)-2-amino-3-(4-hydroxy-2,6-dimethylphenyl...)
Affinity DataIC50:  220nM. Assay description: Agonist activity at mu opioid receptor in guinea pig ileum assessed as inhibition of electrically-stimulated muscle contraction
In DepthDetails ArticlePubMed
TargetDelta-type opioid receptor(Homo sapiens (Human))
University Of Arizona
Curated by ChEMBL
LigandPNGBDBM50334997((R)-2-((S)-2-amino-3-(4-hydroxy-2,6-dimethylphenyl...)
Affinity DataEC50:  30nM. Assay description: Agonist activity at human delta opioid receptor expressed in CHO cells assessed as stimulation of [35S]GTPgammaS binding
In DepthDetails ArticlePubMed
TargetMu-type opioid receptor(Rattus norvegicus (rat))
University Of Arizona
Curated by ChEMBL
LigandPNGBDBM50334997((R)-2-((S)-2-amino-3-(4-hydroxy-2,6-dimethylphenyl...)
Affinity DataIC50:  11nM. Assay description: Displacement of [3H]DAMGO from rat mu opioid receptor expressed in mouse HN9.10 cells
In DepthDetails ArticlePubMed