BDBM50335398 CHEMBL1651551::N-Heptyl-1-deoxynojirimycin
SMILES CCCCCCCN1C[C@H](O)[C@@H](O)[C@H](O)[C@H]1CO
InChI Key InChIKey=MBQCNYZEYQQTEE-YVECIDJPSA-N
Data  1 KI  6 IC50
  Tab Delimited (TSV)   2D SDfile   Computed 3D by Vconf -m prep SDfile
Find this compound or compounds like it in BindingDB:
Activity Spreadsheet -- Enzyme Inhibition Constant Data from BindingDB
Found 7 hits for monomerid = 50335398
TargetLysosomal alpha-glucosidase(Homo sapiens (Human))
University Of Toyama
Curated by ChEMBL
LigandPNGBDBM50335398(CHEMBL1651551 | N-Heptyl-1-deoxynojirimycin)
Affinity DataKi:  95nM. Assay description: Inhibition of human GAA using 4-methylumbelliferyl-alpha-D-glucopyranoside as substrate preincubated for 45 min followed by substrate addition and me...
In DepthDetails ArticlePubMed
TargetCeramide glucosyltransferase(Mus musculus)
TBA
Curated by ChEMBL
LigandPNGBDBM50335398(CHEMBL1651551 | N-Heptyl-1-deoxynojirimycin)
Affinity DataIC50:  4.00E+4nM. Assay description: Inhibition of glucosylceramide synthase in mouse RAW cells preincubated with compound for 15 mins by in-situ enzyme inhibition assay
In DepthDetails ArticlePubMed
TargetLysosomal alpha-glucosidase(Mus musculus (Mouse))
TBA
Curated by ChEMBL
LigandPNGBDBM50335398(CHEMBL1651551 | N-Heptyl-1-deoxynojirimycin)
Affinity DataIC50:  1.00E+4nM. Assay description: Inhibition of maltase in mouse intestinal input by glucose release assay
In DepthDetails ArticlePubMed
TargetSucrase-isomaltase(Mus musculus)
TBA
Curated by ChEMBL
LigandPNGBDBM50335398(CHEMBL1651551 | N-Heptyl-1-deoxynojirimycin)
Affinity DataIC50:  500nM. Assay description: Inhibition of sucrase in mouse intestinal input by glucose release assay
In DepthDetails ArticlePubMed
TargetNon-lysosomal glucosylceramidase(Homo sapiens (Human))
TBA
Curated by ChEMBL
LigandPNGBDBM50335398(CHEMBL1651551 | N-Heptyl-1-deoxynojirimycin)
Affinity DataIC50:  45nM. Assay description: Inhibition of recombinant GBA2 preincuabated with compound for 30 mins using 4-methylumbelliferyl-B-glucoside substrate by fluorimetric assay
In DepthDetails ArticlePubMed
TargetLysosomal acid glucosylceramidase(Homo sapiens (Human))
TBA
Curated by ChEMBL
LigandPNGBDBM50335398(CHEMBL1651551 | N-Heptyl-1-deoxynojirimycin)
Affinity DataIC50:  1.85E+4nM. Assay description: Inhibition of recombinant GBA1 preincuabated with compound for 30 mins using 4-methylumbelliferyl-B-glucoside substrate by fluorimetric assay
In DepthDetails ArticlePubMed
TargetBeta-galactosidase(Mus musculus)
TBA
Curated by ChEMBL
LigandPNGBDBM50335398(CHEMBL1651551 | N-Heptyl-1-deoxynojirimycin)
Affinity DataIC50:  5.00E+5nM. Assay description: Inhibition of lactase in mouse intestinal input by glucose release assay
In DepthDetails ArticlePubMed