BDBM50336284 3-[3'-(2''cyclopent-2'''-en-1'''-ylphenoxy)-2'-hydroxypropyl]-5,5-dimethylimidazolidine-2,4-dione::CHEMBL1669810
SMILES CC1(C)NC(=O)N(CC(O)COc2ccccc2C2CCCC2)C1=O
InChI Key InChIKey=BCNKEBQQBXYCHE-UHFFFAOYSA-N
Data  4 IC50
  Tab Delimited (TSV)   2D SDfile   Computed 3D by Vconf -m prep SDfile
Find this compound or compounds like it in BindingDB:
Activity Spreadsheet -- Enzyme Inhibition Constant Data from BindingDB
Found 4 hits for monomerid = 50336284
TargetArylamine N-acetyltransferase(Mycobacterium smegmatis)
University Of Oxford
Curated by ChEMBL
LigandPNGBDBM50336284(3-[3'-(2''cyclopent-2'''-en-1'''-ylphenoxy)-2'-hyd...)
Affinity DataIC50:  9.40E+3nM. Assay description: Inhibition of Mycobacterium smegmatis NAT using isoniazed substrate by acetyl-coA hydrolysis assay
In DepthDetails ArticlePubMed
TargetArylamine N-acetyltransferase(Pseudomonas aeruginosa)
University Of Oxford
Curated by ChEMBL
LigandPNGBDBM50336284(3-[3'-(2''cyclopent-2'''-en-1'''-ylphenoxy)-2'-hyd...)
Affinity DataIC50:  1.62E+4nM. Assay description: Inhibition of Pseudomonas aeruginosa NAT using 5-aminosalicylate substrate by acetyl-coA hydrolysis assay
In DepthDetails ArticlePubMed
TargetArylamine N-acetyltransferase(Pseudomonas aeruginosa)
University Of Oxford
Curated by ChEMBL
LigandPNGBDBM50336284(3-[3'-(2''cyclopent-2'''-en-1'''-ylphenoxy)-2'-hyd...)
Affinity DataIC50:  3.70E+4nM. Assay description: Inhibition of Pseudomonas aeruginosa NAT using isoniazed substrate by acetyl-coA hydrolysis assay
In DepthDetails ArticlePubMed
TargetArylamine N-acetyltransferase(Mycobacterium smegmatis)
University Of Oxford
Curated by ChEMBL
LigandPNGBDBM50336284(3-[3'-(2''cyclopent-2'''-en-1'''-ylphenoxy)-2'-hyd...)
Affinity DataIC50:  1.77E+4nM. Assay description: Inhibition of Mycobacterium smegmatis NAT using 5-aminosalicylate substrate by acetyl-coA hydrolysis assay
In DepthDetails ArticlePubMed