BDBM50336549 5-(6-Aminopurin-9-yl)-4-iodo-3-hydroxymethylcyclopent-3-ene-1,2-diol::CHEMBL1672010
SMILES Nc1ncnc2n(cnc12)[C@H]1[C@H](O)[C@H](O)C(CO)=C1I
InChI Key InChIKey=WMZNOGDJDZBFTH-HLTSFMKQSA-N
Data  1 IC50
  Tab Delimited (TSV)   2D SDfile   Computed 3D by Vconf -m prep SDfile
Find this compound or compounds like it in BindingDB:
Activity Spreadsheet -- Enzyme Inhibition Constant Data from BindingDB
Found 1 hit for monomerid = 50336549
TargetAdenosylhomocysteinase(Homo sapiens (Human))
Ewha Womans University
Curated by ChEMBL
LigandPNGBDBM50336549(5-(6-Aminopurin-9-yl)-4-iodo-3-hydroxymethylcyclop...)
Affinity DataIC50: >1.00E+6nM. Assay description: Inhibition of human placental AdoHcy hydrolase expressed in Escherichia coli JM109
In DepthDetails ArticlePubMed