BDBM50336666 CHEMBL1672468::N-[(17-Cyclopropylmethyl-6beta,14beta-epoxy-3-hydroxymorphinan-6alpha-yl)methyl]-3-methylbenzamide
SMILES Cc1cccc(c1)C(=O)NC[C@@]12CC[C@@]3(O1)[C@H]1Cc4ccc(O)cc4[C@]3(C2)CCN1CC1CC1
InChI Key InChIKey=YXGPVAPCDIGKQE-KKAKYAENSA-N
Data  2 KI
  Tab Delimited (TSV)   2D SDfile   Computed 3D by Vconf -m prep SDfile
Find this compound or compounds like it in BindingDB:
Activity Spreadsheet -- Enzyme Inhibition Constant Data from BindingDB
Found 2 hits for monomerid = 50336666
TargetKappa-type opioid receptor(Cavia porcellus (domestic guinea pig))
Kitasato University
Curated by ChEMBL
LigandPNGBDBM50336666(CHEMBL1672468 | N-[(17-Cyclopropylmethyl-6beta,14b...)
Affinity DataKi:  0.126nM. Assay description: Displacement of [3H]U69593 from kappa opioid receptor in guinea pig cerebellum
In DepthDetails ArticlePubMed
TargetMu-type opioid receptor(GUINEA PIG)
Kitasato University
Curated by ChEMBL
LigandPNGBDBM50336666(CHEMBL1672468 | N-[(17-Cyclopropylmethyl-6beta,14b...)
Affinity DataKi:  0.156nM. Assay description: Displacement of [3H]DAMGO from mu opioid receptor in guinea pig forebrain
In DepthDetails ArticlePubMed