BDBM503380 2-(4-Amino-4-methyl-piperidin-1- yl)-5-(2-chloro-4-fluoro-phenyl)-6- methyl-pyrimidine-4-carboxylic acid amide::US11033547, Compound 82::US11696916, Compound 82
SMILES Cc1nc(nc(C(N)=O)c1-c1ccc(F)cc1Cl)N1CCC(C)(N)CC1
InChI Key InChIKey=JDJOYVZXUUSEHT-UHFFFAOYSA-N
Data  2 IC50
  Tab Delimited (TSV)   2D SDfile   Computed 3D by Vconf -m prep SDfile
Find this compound or compounds like it in BindingDB:
Activity Spreadsheet -- Enzyme Inhibition Constant Data from BindingDB
Found 2 hits for monomerid = 503380
TargetTyrosine-protein phosphatase non-receptor type 11(Homo sapiens)
Merck Patent
US Patent
LigandPNGBDBM503380(2-(4-Amino-4-methyl-piperidin-1- yl)-5-(2-chloro-4...)
Affinity DataIC50:  2.00E+3nM. Assay description: The inhibition of SHP2 by compounds of the invention was monitored using the surrogate substrate DiFMUP after protein activation by a peptide bearing...
Ligand InfoPC cidPC sid
In DepthDetails US Patent
TargetTyrosine-protein phosphatase non-receptor type 11(Homo sapiens (Human))
Merck Patent
US Patent
LigandPNGBDBM503380(2-(4-Amino-4-methyl-piperidin-1- yl)-5-(2-chloro-4...)
Affinity DataIC50:  2.00E+3nM. Assay description: The inhibition of SHP2 by compounds of the invention was monitored using the surrogate substrate DiFMUP after protein activation by a peptide bearing...
Ligand InfoPC cidPC sid
In DepthDetails US Patent