BDBM50338355 CHEMBL1682894::rac-N-Ethyl-6-[1-Hydroxy-1-(1H-imidazol-4-yl)-2-methylpropyl]-2-naphthamide
SMILES CCNC(=O)c1ccc2cc(ccc2c1)C(O)(C(C)C)c1cnc[nH]1
InChI Key InChIKey=JYTGSYXSDJJCCR-UHFFFAOYSA-N
Data  3 IC50
  Tab Delimited (TSV)   2D SDfile   Computed 3D by Vconf -m prep SDfile
Find this compound or compounds like it in BindingDB:
Activity Spreadsheet -- Enzyme Inhibition Constant Data from BindingDB
Found 3 hits for monomerid = 50338355
TargetSteroid 17-alpha-hydroxylase/17,20 lyase(Rattus norvegicus (Rat))
Takeda Pharmaceutical
Curated by ChEMBL
LigandPNGBDBM50338355(CHEMBL1682894 | rac-N-Ethyl-6-[1-Hydroxy-1-(1H-imi...)
Affinity DataIC50:  11nM. Assay description: Inhibition of 17,20 lyase activity in Sprague-Dawley rat testicular microsomes
In DepthDetails ArticlePubMed
TargetCytochrome P450 3A4(Homo sapiens (Human))
Takeda Pharmaceutical
Curated by ChEMBL
LigandPNGBDBM50338355(CHEMBL1682894 | rac-N-Ethyl-6-[1-Hydroxy-1-(1H-imi...)
Affinity DataIC50:  5.70E+3nM. Assay description: Inhibition of human CYP3A4
In DepthDetails ArticlePubMed
TargetSteroid 17-alpha-hydroxylase/17,20 lyase(Homo sapiens (Human))
Takeda Pharmaceutical
Curated by ChEMBL
LigandPNGBDBM50338355(CHEMBL1682894 | rac-N-Ethyl-6-[1-Hydroxy-1-(1H-imi...)
Affinity DataIC50:  46nM. Assay description: Inhibition of 17,20 lyase activity in human
In DepthDetails ArticlePubMed