BDBM50339245 6-amino-N-((4S,7S,13S,16S)-13-sec-butyl-4-carbamoyl-7-(3-guanidinopropyl)-2,18-dimethyl-6,9,12,15-tetraoxo-5,8,11,14-tetraazanonadecan-16-yl)nicotinamide::CHEMBL1689561
SMILES [#6]-[#6]-[#6@H](-[#6])-[#6@H](-[#7]-[#6](=O)-[#6@H](-[#6]-[#6](-[#6])-[#6])-[#7]-[#6](=O)-c1ccc(-[#7])nc1)-[#6](=O)-[#7]-[#6]-[#6](=O)-[#7]-[#6@@H](-[#6]-[#6]-[#6]\[#7]=[#6](\[#7])-[#7])-[#6](=O)-[#7]-[#6@@H](-[#6]-[#6](-[#6])-[#6])-[#6](-[#7])=O
InChI Key InChIKey=FZHMCIGNLYTREM-OPTWNZHXSA-N
Data  2 EC50
  Tab Delimited (TSV)   2D SDfile   Computed 3D by Vconf -m prep SDfile
Find this compound or compounds like it in BindingDB:
Activity Spreadsheet -- Enzyme Inhibition Constant Data from BindingDB
Found 2 hits for monomerid = 50339245
TargetProteinase-activated receptor 2(Homo sapiens (Human))
University Of Arizona
Curated by ChEMBL
LigandPNGBDBM50339245(6-amino-N-((4S,7S,13S,16S)-13-sec-butyl-4-carbamoy...)
Affinity DataEC50:  2.60E+3nM. Assay description: Agonist activity at PAR2 in human 16HBE14o cells assessed as increase in intracellular calcium levels by in vitro physiological response assay
In DepthDetails ArticlePubMed
TargetProteinase-activated receptor 2(Homo sapiens (Human))
University Of Arizona
Curated by ChEMBL
LigandPNGBDBM50339245(6-amino-N-((4S,7S,13S,16S)-13-sec-butyl-4-carbamoy...)
Affinity DataEC50:  311nM. Assay description: Agonist activity at PAR2 in human 16HBE14o cells assessed as increase in intracellular calcium levels measured every 15 second for 2 hrs by xCelligen...
In DepthDetails ArticlePubMed