BDBM503397 (5P)-2-[(3aR,7aS)-3a- (aminomethyl)-octahydro-1H- isoindol-2-yl]-6-amino-5-(2,3- dichlorophenyl)pyrimidine-4- carboxamide::US11033547, Compound 100::US11033547, Compound 102::US11696916, Compound 102
SMILES NC[C@]12CN(C[C@H]1CCCC2)c1nc(N)c(-c2cccc(Cl)c2Cl)c(n1)C(N)=O
InChI Key InChIKey=IKMGLAPRJVWUEO-BIBXISHDSA-N
Data  4 IC50
  Tab Delimited (TSV)   2D SDfile   Computed 3D by Vconf -m prep SDfile
Find this compound or compounds like it in BindingDB:
Activity Spreadsheet -- Enzyme Inhibition Constant Data from BindingDB
Found 4 hits for monomerid = 503397
TargetTyrosine-protein phosphatase non-receptor type 11(Homo sapiens (Human))
Merck Patent
US Patent
LigandPNGBDBM503397((5P)-2-[(3aR,7aS)-3a- (aminomethyl)-octahydro-1H- ...)
Affinity DataIC50:  500nM. Assay description: The inhibition of SHP2 by compounds of the invention was monitored using the surrogate substrate DiFMUP after protein activation by a peptide bearing...
Ligand InfoPC cidPC sid
In DepthDetails US Patent
TargetTyrosine-protein phosphatase non-receptor type 11(Homo sapiens)
Merck Patent
US Patent
LigandPNGBDBM503397((5P)-2-[(3aR,7aS)-3a- (aminomethyl)-octahydro-1H- ...)
Affinity DataIC50:  1.70E+4nM. Assay description: The inhibition of SHP2 by compounds of the invention was monitored using the surrogate substrate DiFMUP after protein activation by a peptide bearing...
Ligand InfoPC cidPC sid
In DepthDetails US Patent
TargetTyrosine-protein phosphatase non-receptor type 11(Homo sapiens)
Merck Patent
US Patent
LigandPNGBDBM503397((5P)-2-[(3aR,7aS)-3a- (aminomethyl)-octahydro-1H- ...)
Affinity DataIC50:  500nM. Assay description: The inhibition of SHP2 by compounds of the invention was monitored using the surrogate substrate DiFMUP after protein activation by a peptide bearing...
Ligand InfoPC cidPC sid
In DepthDetails US Patent
TargetTyrosine-protein phosphatase non-receptor type 11(Homo sapiens (Human))
Merck Patent
US Patent
LigandPNGBDBM503397((5P)-2-[(3aR,7aS)-3a- (aminomethyl)-octahydro-1H- ...)
Affinity DataIC50:  1.70E+4nM. Assay description: The inhibition of SHP2 by compounds of the invention was monitored using the surrogate substrate DiFMUP after protein activation by a peptide bearing...
Ligand InfoPC cidPC sid
In DepthDetails US Patent