BDBM50339929 CHEMBL1761667::N1-((S)-1-((S)-1-amino-3-(4-hydroxyphenyl)-1-oxopropan-2-ylamino)-3-(1H-indol-3-yl)-1-oxopropan-2-yl)-N4-(4-hydroxyphenyl)succinamide
SMILES NC(=O)[C@H](Cc1ccc(O)cc1)NC(=O)[C@H](Cc1c[nH]c2ccccc12)NC(=O)CCC(=O)Nc1ccc(O)cc1
InChI Key InChIKey=ITIAYPYIEGSURZ-UIOOFZCWSA-N
Data  1 KI
  Tab Delimited (TSV)   2D SDfile   Computed 3D by Vconf -m prep SDfile
Find this compound or compounds like it in BindingDB:
Activity Spreadsheet -- Enzyme Inhibition Constant Data from BindingDB
Found 1 hit for monomerid = 50339929
TargetAlpha-amylase(Bacillus stearothermophilus)
Seoul National University
Curated by ChEMBL
LigandPNGBDBM50339929(CHEMBL1761667 | N1-((S)-1-((S)-1-amino-3-(4-hydrox...)
Affinity DataKi:  1.40E+6nM. Assay description: Competitive inhibition of Bacillus stearothermophilus alpha-glucosidase assessed as production of chromogenic p-Nitrphenol measured after 3 mins by H...
In DepthDetails ArticlePubMed